{"text_format":"1","workbook":"xlsx","n_sheets":6,"sheets":["HOME","Phatsinh","In-Chi","In-Thu","SOQUY","CDPS"],"not_rendered":{"charts":0,"images":0,"macros":1,"external_links":0,"defined_names":31,"comments":0,"pivot_tables":0},"unopened":[],"bounds":{"document_bytes":16777216,"sheet_cells":100000,"rows_first":2000,"rows_last":500,"rows_between":2000,"halvings":0,"cell_chars":16384,"cell_head_chars":4096},"cells_cut":0,"cells_raw":0,"read":"whole","date_system":"1900"}

{"sheet":"HOME","index":0,"n_rows":18,"n_cols":24,"rows_kept":18,"cut":false,"hidden":false,"merged":[[7,2,7,4],[7,6,7,13],[3,2,3,13],[5,2,5,4],[5,6,5,13],[6,2,6,4],[6,6,6,13],[12,2,12,4],[12,6,12,13],[9,2,9,4],[9,6,9,13],[10,2,10,4],[10,6,10,13],[11,2,11,4],[11,6,11,13]]}
[]
[]
[]
[null,null,"THÔNG TIN DOANH NGHIỆP"]
[null,null,null,null,null,null,null,null,null,null,null,null,null,null,null,"1. KHAI BÁO DANH MỤC",null,null,null,null,null,null,null,"Click xem"]
[null,null,"Công ty",null,null,":","TAICHINHCANHAN.PRO.VN",null,null,null,null,null,null,null,null,null,"- Khai báo danh mục số TK",null,null,"=> Bảng kê: DANH MỤC TÀI KHOẢN"]
[null,null,"Địa chỉ",null,null,":","MỸ ĐÌNH - TỪ LIÊM - HÀ NỘI",null,null,null,null,null,null,null,null,"2. PHÁT SINH"]
[null,null,"MST",null,null,":","038 997 8430",null,null,null,null,null,null,null,null,null,"- Ghi nhận thực tế thu chi trong doanh nghiệp",null,null,null,null,null,null,"Click xem"]
[null,null,null,null,null,null,null,null,null,null,null,null,null,null,null,null,null,"+ Thông tin trên phiếu"]
[null,null,"Giám đốc",null,null,":","Nguyễn Văn A",null,null,null,null,null,null,null,null,null,null,"+ Thông tin người giao dịch"]
{"$rows_left_out":9}
{"sheet":"Phatsinh","index":1,"n_rows":69,"n_cols":16,"rows_kept":69,"cut":false,"hidden":false,"merged":[[7,11,7,13],[7,14,8,14],[7,15,8,15],[5,1,5,10],[7,1,7,2],[7,3,8,3],[7,4,8,4],[7,5,7,6],[7,7,7,8],[7,9,8,9],[7,10,8,10]]}
[]
[]
[null,{"$f":"ten","v":"TAICHINHCANHAN.PRO.VN"}]
[null,{"$f":"DC","v":"MỸ ĐÌNH - TỪ LIÊM - HÀ NỘI"}]
[null,{"$f":"MST","v":"038 997 8430"}]
[null,"HẠCH TOÁN NGHIỆP VỤ KINH TẾ PHÁT SINH"]
[null,1,null,2,null,5,6,"x-cấm xoá","x",16,null,19,20,21,22,23]
[null,"Chứng từ",null,"Ngày tháng ghi sổ","Diễn giải  ","TK",null,"Mã ĐT",null,"Thành Tiền","Mã TT","Thông tin về người giao dịch",null,null,"Kèm\ntheo","Chứng\ntừ"]
[null,"Số","Ngày",null,null,"Nợ","Có","Nội bộ","Ngoài",null,null,"Họ và tên","Đơn vị","Địa chỉ"]
[null,"PC01/001","2017-01-01","2017-01-01","Thanh toán tiền cước viễn thông T12/07 ( SM 2444357 )",6422,111,{"$f":"IFERROR(IF(OR(F10=SOQUY!$E$7,G10=SOQUY!$E$7),SOQUY!$E$7,0),\"\")","v":0},null,150774,null,"Anh Hai","Công ty TNHH ABC","Nguyễn Chí Thanh - Hà Nội",1,"HĐ AA-2010T - 0505058"]
{"$rows_left_out":60}
{"sheet":"In-Chi","index":2,"n_rows":52,"n_cols":256,"rows_kept":52,"cut":false,"hidden":false,"merged":[[3,5,5,10],[3,12,3,18],[4,12,4,18],[5,12,5,18],[6,7,6,8],[15,1,16,18],[7,23,7,24],[8,0,8,5],[8,6,8,9],[8,14,8,15],[8,16,8,18],[9,14,9,15],[9,16,9,18],[7,4,7,11],[7,14,7,15],[7,16,7,18],[10,3,10,6],[11,3,11,9],[12,3,12,18],[14,2,14,5],[14,6,14,18],[17,2,17,3],[17,7,17,18],[18,12,18,18],[19,0,19,2],[19,3,19,6],[19,7,19,10],[19,11,19,14],[19,15,19,18],[24,0,24,2],[24,3,24,6],[24,7,24,10],[24,11,24,14],[24,15,24,18],[20,0,20,2],[20,3,20,6],[20,7,20,10],[20,11,20,14],[20,15,20,18],[25,0,25,18],[26,0,26,18],[28,5,30,10],[28,12,28,18],[29,12,29,18],[30,12,30,18],[31,7,31,8],[32,4,32,11],[32,14,32,15],[32,16,32,18],[33,0,33,5],[33,6,33,9],[33,14,33,15],[33,16,33,18],[34,14,34,15],[34,16,34,18],[35,3,35,6],[36,3,36,8],[39,2,39,5],[39,6,39,18],[40,1,41,18],[42,2,42,3],[42,7,42,18],[43,12,43,18],[44,0,44,2],[44,3,44,6],[44,7,44,10],[44,11,44,14],[44,15,44,18],[50,0,50,18],[51,0,51,18],[45,0,45,2],[45,3,45,6],[45,7,45,10],[45,11,45,14],[45,15,45,18],[49,0,49,2],[49,3,49,6],[49,7,49,10],[49,11,49,14],[49,15,49,18]]}
[]
[]
[]
[{"$f":"\"Đơn vị : \"&ten","v":"Đơn vị : TAICHINHCANHAN.PRO.VN"},null,null,null,null,"PHIẾU CHI",null,null,null,null,null,null,"Mẫu số 02 - TT"]
[{"$f":"\"Địa chỉ :\"&\" \"&DC","v":"Địa chỉ : MỸ ĐÌNH - TỪ LIÊM - HÀ NỘI"},null,null,null,null,null,null,null,null,null,null,null,"(Ban hành theo TT số 133/2016/TT-BTC"]
[null,null,null,null,null,null,null,null,null,null,null,null,"ngày 26/08/2016 của Bộ Tài Chính)",null,null,null,null,null,null,null,null,null,null,null,null,null,null,null,null,null,null,null,null,null,null,null,null,null,null,null,null,null,null,null,null,null,null,null,null,null,null,null,null,null,null,null,null,null,null,null,null,null,null,null,null,null,null,null,null,null,null,null,null,null,null,null,null,null,null,null,null,null,null,null,null,null,null,null,null,null,null,null,null,null,null,null,null,null,null,null,null,null,null,null,null,null,null,null,null,null,null,null,null,null,null,null,null,null,null,null,null,null,null,null,null,null,null,null,null,null,null,null,null,null,null,null,null,null,null,null,null,null,null,null,null,null,null,null,null,null,null,null,null,null,null,null,null,null,null,null,null,null,null,null,null,null,null,null,null,null,null,null,null,null,null,null,null,null,null,null,null,null,null,null,null,null,null,null,null,null,null,null,{"$f":"C15","v":165875},{"$f":"RIGHT(\"000000000000\"&ROUND(GK6,0),12)","v":"000000165875"},1,2,3,4,5,6,7,8,9,10,11,12]
[null,null,null,null,null,null,"Số :","PC01/002"]
[null,null,null,null,{"$f":"+IF($F$4=\"\",\"\",VLOOKUP($H$7,Phatsinh!$B$10:$P$69,2,0))","v":"2017-01-01"},null,null,null,null,null,null,null,null,"Nợ",{"$f":"IF(ISNA(VLOOKUP(H7,Phatsinh!$B:$T,5,0)),\"\",VLOOKUP(H7,Phatsinh!$B:$T,5,0))","v":141},null,{"$f":"IF(O8=\"\",\"\",VLOOKUP(H7,Phatsinh!$B:$T,9,0))","v":165875},null,null,null,null,null,null,null,null,null,null,null,null,null,null,null,null,null,null,null,null,null,null,null,null,null,null,null,null,null,null,null,null,null,null,null,null,null,null,null,null,null,null,null,null,null,null,null,null,null,null,null,null,null,null,null,null,null,null,null,null,null,null,null,null,null,null,null,null,null,null,null,null,null,null,null,null,null,null,null,null,null,null,null,null,null,null,null,null,null,null,null,null,null,null,null,null,null,null,null,null,null,null,null,null,null,null,null,null,null,null,null,null,null,null,null,null,null,null,null,null,null,null,null,null,null,null,null,null,null,null,null,null,null,null,null,null,null,null,null,null,null,null,null,null,null,null,null,null,null,null,null,null,null,null,null,null,null,null,null,null,null,null,null,null,null,null,null,null,null,null,null,null,null,null,null,null,null,{"$f":"VALUE(MID(GL6,GM6,1))","v":0},{"$f":"VALUE(MID(GL6,GN6,1))","v":0},{"$f":"VALUE(MID(GL6,GO6,1))","v":0},{"$f":"VALUE(MID(GL6,GP6,1))","v":0},{"$f":"VALUE(MID(GL6,GQ6,1))","v":0},{"$f":"VALUE(MID(GL6,GR6,1))","v":0},{"$f":"VALUE(MID(GL6,GS6,1))","v":1},{"$f":"VALUE(MID(GL6,GT6,1))","v":6},{"$f":"VALUE(MID(GL6,GU6,1))","v":5},{"$f":"VALUE(MID(GL6,GV6,1))","v":8},{"$f":"VALUE(MID(GL6,GW6,1))","v":7},{"$f":"VALUE(MID(GL6,GX6,1))","v":5},null,null,null,null,null,null,null,null,null,null,null,null,null,null,null,null,null,null,null,null,null,null,null,null,null,null,null,null,null,null,null,null,null,null,null,null,{"$f":"'In-Thu'!C15","v":165875},{"$f":"RIGHT(\"000000000000\"&ROUND(II8,0),12)","v":"000000165875"},1,2,3,4,5,6,7,8,9,10,11,12]
[null,null,null,null,null,null,"Liên 1",null,null,null,null,null,null,{"$f":"IF(Q9<>\"\",\"Nợ\",\"\")","v":""},{"$f":"IF(Q9<>\"\",\"1331\",\"\")","v":""},null,{"$f":"IF(OFFSET(Phatsinh!B10,MATCH(H7,Phatsinh!$B$10:$B$69,0),0)=H7,OFFSET(Phatsinh!J10,MATCH(H7,Phatsinh!$B$10:$B$69,0),0),\"\")","v":""},null,null,null,null,null,null,null,null,null,null,null,null,null,null,null,null,null,null,null,null,null,null,null,null,null,null,null,null,null,null,null,null,null,null,null,null,null,null,null,null,null,null,null,null,null,null,null,null,null,null,null,null,null,null,null,null,null,null,null,null,null,null,null,null,null,null,null,null,null,null,null,null,null,null,null,null,null,null,null,null,null,null,null,null,null,null,null,null,null,null,null,null,null,null,null,null,null,null,null,null,null,null,null,null,null,null,null,null,null,null,null,null,null,null,null,null,null,null,null,null,null,null,null,null,null,null,null,null,null,null,null,null,null,null,null,null,null,null,null,null,null,null,null,null,null,null,null,null,null,null,null,null,null,null,null,null,null,null,null,null,null,null,null,null,null,null,null,null,null,null,null,null,null,null,null,null,null,{"$f":"SUM(GM8:GM8)","v":0},{"$f":"SUM(GM8:GN8)","v":0},{"$f":"SUM(GM8:GO8)","v":0},{"$f":"SUM(GP8:GP8)","v":0},{"$f":"SUM(GP8:GQ8)","v":0},{"$f":"SUM(GP8:GR8)","v":0},{"$f":"SUM(GS8:GS8)","v":1},{"$f":"SUM(GS8:GT8)","v":7},{"$f":"SUM(GS8:GU8)","v":12},{"$f":"SUM(GV8:GV8)","v":8},{"$f":"SUM(GV8:GW8)","v":15},{"$f":"SUM(GV8:GX8)","v":20},null,null,null,null,null,null,null,null,null,null,null,null,null,null,null,null,null,null,null,null,null,null,null,null,null,null,null,null,null,null,null,null,null,null,null,null,null,null,{"$f":"VALUE(MID(IJ8,IK8,1))","v":0},{"$f":"VALUE(MID(IJ8,IL8,1))","v":0},{"$f":"VALUE(MID(IJ8,IM8,1))","v":0},{"$f":"VALUE(MID(IJ8,IN8,1))","v":0},{"$f":"VALUE(MID(IJ8,IO8,1))","v":0},{"$f":"VALUE(MID(IJ8,IP8,1))","v":0},{"$f":"VALUE(MID(IJ8,IQ8,1))","v":1},{"$f":"VALUE(MID(IJ8,IR8,1))","v":6},{"$f":"VALUE(MID(IJ8,IS8,1))","v":5},{"$f":"VALUE(MID(IJ8,IT8,1))","v":8},{"$f":"VALUE(MID(IJ8,IU8,1))","v":7},{"$f":"VALUE(MID(IJ8,IV8,1))","v":5}]
[null,null,null,null,null,null,null,null,null,null,null,null,null,"Có",1111,null,{"$f":"IF(Q9=\"\",Q8,Q8+Q9)","v":165875},null,null,null,null,null,null,null,null,null,null,null,null,null,null,null,null,null,null,null,null,null,null,null,null,null,null,null,null,null,null,null,null,null,null,null,null,null,null,null,null,null,null,null,null,null,null,null,null,null,null,null,null,null,null,null,null,null,null,null,null,null,null,null,null,null,null,null,null,null,null,null,null,null,null,null,null,null,null,null,null,null,null,null,null,null,null,null,null,null,null,null,null,null,null,null,null,null,null,null,null,null,null,null,null,null,null,null,null,null,null,null,null,null,null,null,null,null,null,null,null,null,null,null,null,null,null,null,null,null,null,null,null,null,null,null,null,null,null,null,null,null,null,null,null,null,null,null,null,null,null,null,null,null,null,null,null,null,null,null,null,null,null,null,null,null,null,null,null,null,null,null,null,null,null,null,null,null,{"$f":"IF(GM8=0,\"\",CHOOSE(GM8,\"một\",\"hai\",\"ba\",\"bốn\",\"năm\",\"sáu\",\"bảy\",\"tám\",\"chín\"))","v":""},{"$f":"IF(GN8=0,IF(AND(GM8<>0,GO8<>0),\"lẻ\",\"\"),CHOOSE(GN8,\"mười\",\"hai\",\"ba\",\"bốn\",\"năm\",\"sáu\",\"bảy\",\"tám\",\"chín\"))","v":""},{"$f":"IF(GO8=0,\"\",CHOOSE(GO8,IF(GN8>1,\"mốt\",\"một\"),\"hai\",\"ba\",\"bốn\",IF(GN8=0,\"năm\",\"lăm\"),\"sáu\",\"bảy\",\"tám\",\"chín\"))","v":""},{"$f":"IF(GP8=0,\"\",CHOOSE(GP8,\"một\",\"hai\",\"ba\",\"bốn\",\"năm\",\"sáu\",\"bảy\",\"tám\",\"chín\"))","v":""},{"$f":"IF(GQ8=0,IF(AND(GP8<>0,GR8<>0),\"lẻ\",\"\"),CHOOSE(GQ8,\"mười\",\"hai\",\"ba\",\"bốn\",\"năm\",\"sáu\",\"bảy\",\"tám\",\"chín\"))","v":""},{"$f":"IF(GR8=0,\"\",CHOOSE(GR8,IF(GQ8>1,\"mốt\",\"một\"),\"hai\",\"ba\",\"bốn\",IF(GQ8=0,\"năm\",\"lăm\"),\"sáu\",\"bảy\",\"tám\",\"chín\"))","v":""},{"$f":"IF(GS8=0,\"\",CHOOSE(GS8,\"một\",\"hai\",\"ba\",\"bốn\",\"năm\",\"sáu\",\"bảy\",\"tám\",\"chín\"))","v":"một"},{"$f":"IF(GT8=0,IF(AND(GS8<>0,GU8<>0),\"lẻ\",\"\"),CHOOSE(GT8,\"mười\",\"hai\",\"ba\",\"bốn\",\"năm\",\"sáu\",\"bảy\",\"tám\",\"chín\"))","v":"sáu"},{"$f":"IF(GU8=0,\"\",CHOOSE(GU8,IF(GT8>1,\"mốt\",\"một\"),\"hai\",\"ba\",\"bốn\",IF(GT8=0,\"năm\",\"lăm\"),\"sáu\",\"bảy\",\"tám\",\"chín\"))","v":"lăm"},{"$f":"IF(GV8=0,\"\",CHOOSE(GV8,\"một\",\"hai\",\"ba\",\"bốn\",\"năm\",\"sáu\",\"bảy\",\"tám\",\"chín\"))","v":"tám"},{"$f":"IF(GW8=0,IF(AND(GV8<>0,GX8<>0),\"lẻ\",\"\"),CHOOSE(GW8,\"mười\",\"hai\",\"ba\",\"bốn\",\"năm\",\"sáu\",\"bảy\",\"tám\",\"chín\"))","v":"bảy"},{"$f":"IF(GX8=0,\"\",CHOOSE(GX8,IF(GW8>1,\"mốt\",\"một\"),\"hai\",\"ba\",\"bốn\",IF(GW8=0,\"năm\",\"lăm\"),\"sáu\",\"bảy\",\"tám\",\"chín\"))","v":"lăm"},null,null,null,null,null,null,null,null,null,null,null,null,null,null,null,null,null,null,null,null,null,null,null,null,null,null,null,null,null,null,null,null,null,null,null,null,null,null,{"$f":"SUM(IK9:IK9)","v":0},{"$f":"SUM(IK9:IL9)","v":0},{"$f":"SUM(IK9:IM9)","v":0},{"$f":"SUM(IN9:IN9)","v":0},{"$f":"SUM(IN9:IO9)","v":0},{"$f":"SUM(IN9:IP9)","v":0},{"$f":"SUM(IQ9:IQ9)","v":1},{"$f":"SUM(IQ9:IR9)","v":7},{"$f":"SUM(IQ9:IS9)","v":12},{"$f":"SUM(IT9:IT9)","v":8},{"$f":"SUM(IT9:IU9)","v":15},{"$f":"SUM(IT9:IV9)","v":20}]
{"$rows_left_out":43}
{"sheet":"In-Thu","index":3,"n_rows":55,"n_cols":256,"rows_kept":55,"cut":false,"hidden":false,"merged":[[6,7,6,8],[3,0,3,4],[3,5,5,10],[3,12,3,18],[4,0,4,4],[4,12,5,18],[7,23,7,24],[8,0,8,5],[8,6,8,9],[8,14,8,15],[8,16,8,18],[14,2,14,5],[14,6,14,18],[7,4,7,11],[7,14,7,15],[7,16,7,18],[9,14,9,15],[9,16,9,18],[10,3,10,6],[11,3,11,9],[12,3,12,18],[15,1,16,18],[17,2,17,3],[17,6,17,18],[18,12,18,18],[19,0,19,2],[19,3,19,5],[19,6,19,10],[19,11,19,14],[19,15,19,18],[20,15,20,18],[24,0,24,2],[24,3,24,5],[24,6,24,10],[24,11,24,14],[24,15,24,18],[31,8,31,9],[20,0,20,2],[20,3,20,5],[20,6,20,10],[20,11,20,14],[25,0,25,18],[26,0,26,18],[28,5,30,10],[28,12,28,18],[29,12,30,18],[40,1,41,18],[32,4,32,11],[32,14,32,15],[32,16,32,18],[33,0,33,5],[33,6,33,9],[33,14,33,15],[33,16,33,18],[34,14,34,15],[34,16,34,18],[35,3,35,6],[39,2,39,5],[39,6,39,18],[42,2,42,3],[42,7,42,18],[43,12,43,18],[44,0,44,2],[44,3,44,5],[44,6,44,10],[44,11,44,14],[44,15,44,18],[50,0,50,18],[51,0,51,18],[53,5,53,8],[54,5,54,8],[45,0,45,2],[45,3,45,5],[45,6,45,10],[45,11,45,14],[45,15,45,18],[49,0,49,2],[49,3,49,5],[49,6,49,10],[49,11,49,14],[49,15,49,18]]}
[]
[]
[]
[{"$f":"\"Đơn vị : \"&ten","v":"Đơn vị : TAICHINHCANHAN.PRO.VN"},null,null,null,null,"PHIẾU THU",null,null,null,null,null,null,"Mẫu số 01 - TT"]
[{"$f":"\"Địa chỉ :\"&\" \"&DC","v":"Địa chỉ : MỸ ĐÌNH - TỪ LIÊM - HÀ NỘI"},null,null,null,null,null,null,null,null,null,null,null,"(Ban hành theo TT số 133/2016/TT-BTC ngày 26/08/2016 của Bộ Tài Chính)"]
[]
[null,null,null,null,null,null,"Số :","PC01/002"]
[null,null,null,null,{"$f":"IF($F$4=\"\",\"\",VLOOKUP($H$7,Phatsinh!$B$10:$P$69,2,0))","v":"2017-01-01"},null,null,null,null,null,null,null,null,"Nợ",1111,null,{"$f":"IF(Q10=\"\",Q9,Q9+Q10)","v":165875},null,null,null,null,null,null,null,null,null,null,null,null,null,null,null,null,null,null,null,null,null,null,null,null,null,null,null,null,null,null,null,null,null,null,null,null,null,null,null,null,null,null,null,null,null,null,null,null,null,null,null,null,null,null,null,null,null,null,null,null,null,null,null,null,null,null,null,null,null,null,null,null,null,null,null,null,null,null,null,null,null,null,null,null,null,null,null,null,null,null,null,null,null,null,null,null,null,null,null,null,null,null,null,null,null,null,null,null,null,null,null,null,null,null,null,null,null,null,null,null,null,null,null,null,null,null,null,null,null,null,null,null,null,null,null,null,null,null,null,null,null,null,null,null,null,null,null,null,null,null,null,null,null,null,null,null,null,null,null,null,null,null,null,null,null,null,null,null,null,null,null,null,null,null,null,null,null,null,null,null,null,null,null,null,null,null,{"$f":"C15","v":165875},{"$f":"RIGHT(\"000000000000\"&ROUND(GV8,0),12)","v":"000000165875"},1,2,3,4,5,6,7,8,9,10,11,12,null,null,null,null,null,null,null,null,null,null,null,null,null,null,null,null,null,null,null,null,null,null,null,null,null,{"$f":"'In-Thu'!C15","v":165875},{"$f":"RIGHT(\"000000000000\"&ROUND(II8,0),12)","v":"000000165875"},1,2,3,4,5,6,7,8,9,10,11,12]
[null,null,null,null,null,null,"Liên 1",null,null,null,null,null,null,"Có",{"$f":"VLOOKUP($H$7,Phatsinh!$B$10:$G$69,6,0)","v":112},null,{"$f":"IF(ISNA(VLOOKUP($H$7,PS,9,0)),\"\",VLOOKUP($H$7,Phatsinh!$B$10:$P$69,9,0))","v":165875},null,null,null,null,null,null,null,null,null,null,null,null,null,null,null,null,null,null,null,null,null,null,null,null,null,null,null,null,null,null,null,null,null,null,null,null,null,null,null,null,null,null,null,null,null,null,null,null,null,null,null,null,null,null,null,null,null,null,null,null,null,null,null,null,null,null,null,null,null,null,null,null,null,null,null,null,null,null,null,null,null,null,null,null,null,null,null,null,null,null,null,null,null,null,null,null,null,null,null,null,null,null,null,null,null,null,null,null,null,null,null,null,null,null,null,null,null,null,null,null,null,null,null,null,null,null,null,null,null,null,null,null,null,null,null,null,null,null,null,null,null,null,null,null,null,null,null,null,null,null,null,null,null,null,null,null,null,null,null,null,null,null,null,null,null,null,null,null,null,null,null,null,null,null,null,null,null,null,null,null,null,null,null,null,null,null,null,null,{"$f":"VALUE(MID(GW8,GX8,1))","v":0},{"$f":"VALUE(MID(GW8,GY8,1))","v":0},{"$f":"VALUE(MID(GW8,GZ8,1))","v":0},{"$f":"VALUE(MID(GW8,HA8,1))","v":0},{"$f":"VALUE(MID(GW8,HB8,1))","v":0},{"$f":"VALUE(MID(GW8,HC8,1))","v":0},{"$f":"VALUE(MID(GW8,HD8,1))","v":1},{"$f":"VALUE(MID(GW8,HE8,1))","v":6},{"$f":"VALUE(MID(GW8,HF8,1))","v":5},{"$f":"VALUE(MID(GW8,HG8,1))","v":8},{"$f":"VALUE(MID(GW8,HH8,1))","v":7},{"$f":"VALUE(MID(GW8,HI8,1))","v":5},null,null,null,null,null,null,null,null,null,null,null,null,null,null,null,null,null,null,null,null,null,null,null,null,null,null,null,{"$f":"VALUE(MID(IJ8,IK8,1))","v":0},{"$f":"VALUE(MID(IJ8,IL8,1))","v":0},{"$f":"VALUE(MID(IJ8,IM8,1))","v":0},{"$f":"VALUE(MID(IJ8,IN8,1))","v":0},{"$f":"VALUE(MID(IJ8,IO8,1))","v":0},{"$f":"VALUE(MID(IJ8,IP8,1))","v":0},{"$f":"VALUE(MID(IJ8,IQ8,1))","v":1},{"$f":"VALUE(MID(IJ8,IR8,1))","v":6},{"$f":"VALUE(MID(IJ8,IS8,1))","v":5},{"$f":"VALUE(MID(IJ8,IT8,1))","v":8},{"$f":"VALUE(MID(IJ8,IU8,1))","v":7},{"$f":"VALUE(MID(IJ8,IV8,1))","v":5}]
[null,null,null,null,null,null,null,null,null,null,null,null,null,{"$f":"IF(Q10<>\"\",\"Có\",\"\")","v":""},{"$f":"IF(Q10<>\"\",\"33311\",\"\")","v":""},null,{"$f":"IF(OFFSET(Phatsinh!B10,MATCH(H7,Phatsinh!$B$10:$B$69,0),0)=H7,OFFSET(Phatsinh!J10,MATCH(H7,Phatsinh!$B$10:$B$69,0),0),\"\")","v":""},null,null,null,null,null,null,null,null,null,null,null,null,null,null,null,null,null,null,null,null,null,null,null,null,null,null,null,null,null,null,null,null,null,null,null,null,null,null,null,null,null,null,null,null,null,null,null,null,null,null,null,null,null,null,null,null,null,null,null,null,null,null,null,null,null,null,null,null,null,null,null,null,null,null,null,null,null,null,null,null,null,null,null,null,null,null,null,null,null,null,null,null,null,null,null,null,null,null,null,null,null,null,null,null,null,null,null,null,null,null,null,null,null,null,null,null,null,null,null,null,null,null,null,null,null,null,null,null,null,null,null,null,null,null,null,null,null,null,null,null,null,null,null,null,null,null,null,null,null,null,null,null,null,null,null,null,null,null,null,null,null,null,null,null,null,null,null,null,null,null,null,null,null,null,null,null,null,null,null,null,null,null,null,null,null,null,null,null,{"$f":"SUM(GX9:GX9)","v":0},{"$f":"SUM(GX9:GY9)","v":0},{"$f":"SUM(GX9:GZ9)","v":0},{"$f":"SUM(HA9:HA9)","v":0},{"$f":"SUM(HA9:HB9)","v":0},{"$f":"SUM(HA9:HC9)","v":0},{"$f":"SUM(HD9:HD9)","v":1},{"$f":"SUM(HD9:HE9)","v":7},{"$f":"SUM(HD9:HF9)","v":12},{"$f":"SUM(HG9:HG9)","v":8},{"$f":"SUM(HG9:HH9)","v":15},{"$f":"SUM(HG9:HI9)","v":20},null,null,null,null,null,null,null,null,null,null,null,null,null,null,null,null,null,null,null,null,null,null,null,null,null,null,null,{"$f":"SUM(IK9:IK9)","v":0},{"$f":"SUM(IK9:IL9)","v":0},{"$f":"SUM(IK9:IM9)","v":0},{"$f":"SUM(IN9:IN9)","v":0},{"$f":"SUM(IN9:IO9)","v":0},{"$f":"SUM(IN9:IP9)","v":0},{"$f":"SUM(IQ9:IQ9)","v":1},{"$f":"SUM(IQ9:IR9)","v":7},{"$f":"SUM(IQ9:IS9)","v":12},{"$f":"SUM(IT9:IT9)","v":8},{"$f":"SUM(IT9:IU9)","v":15},{"$f":"SUM(IT9:IV9)","v":20}]
{"$rows_left_out":46}
{"sheet":"SOQUY","index":4,"n_rows":114,"n_cols":9,"rows_kept":114,"cut":false,"hidden":false,"merged":[[2,5,2,6],[3,5,3,6],[4,5,4,6],[5,0,5,6],[9,0,10,0],[9,1,10,1],[9,2,10,2],[9,3,10,3],[9,4,9,6],[103,4,103,6],[104,0,104,2],[104,4,104,6],[105,0,105,2],[105,4,105,6]]}
[]
[]
[{"$f":"ten","v":"TAICHINHCANHAN.PRO.VN"},null,null,null,null,"Mẫu số ……. - DNN"]
[{"$f":"DC","v":"MỸ ĐÌNH - TỪ LIÊM - HÀ NỘI"},null,null,null,null,"(Ban hành theo QĐ số 48/2006/QĐ-BTC"]
[{"$f":"MST","v":"038 997 8430"},null,null,null,null,"ngày 14/09/2006 của Bộ trưởng BTC)"]
["SỔ QUỸ"]
[null,null,null,"Loại quỹ: ",112]
[null,null,null,"Tên Quỹ:",{"$f":"IFERROR(VLOOKUP(E7,DM,2,0),0)","v":"Tiền trên TK cá nhân"}]
[null,null,null,null,null,null,"Đơn vị tính: VNĐ"]
["Ngày tháng ghi sổ","Số hiệu chứng từ","Ngày tháng chứng từ","Diễn giải","Số tiền"]
{"$rows_left_out":105}
{"sheet":"CDPS","index":5,"n_rows":16,"n_cols":14,"rows_kept":16,"cut":false,"hidden":false,"merged":[[4,10,5,10],[4,11,5,11],[4,12,4,13],[2,0,2,8],[3,3,3,4],[3,6,3,7],[4,0,5,0],[4,1,5,1],[4,2,5,2],[4,3,4,4],[4,5,4,6],[4,7,4,8]]}
[]
[]
["BẢNG CÂN ĐỐI PHÁT SINH RÚT GỌN",null,null,null,null,null,null,null,null,null,"DANH MỤC TÀI KHOẢN QUỸ"]
[null,null,"Từ ngày:","2017-01-01",null,"Đến ngày:","2017-01-01",null,"Đơn vị tính: VNĐ",null,null,null,null,"Đơn vị tính: VNĐ"]
["STT","SỐ TK","TÊN TK","DƯ ĐK",null,"PHÁT SINH ",null,"DƯ CK",null,null,"TK ","Tên","Dư đầu","Dư đầu"]
[null,null,null,"NỢ ","CÓ","NỢ ","CÓ","NỢ ","CÓ",null,null,null,"Nợ ","Có"]
[1,{"$f":"IF(K7=\"\",\"\",K7)","v":111},{"$f":"IF(L7=\"\",\"\",L7)","v":"Tiền mặt"},{"$f":"+MAX(IF(M7=\"\",0,M7)+SUMIFS(THANHTIEN,TK_N,B7,NGAY,\"<\"&CD_START)-IF(N7=\"\",0,N7)-SUMIFS(THANHTIEN,TK_C,B7,NGAY,\"<\"&CD_START),0)","v":10000000},{"$f":"MAX(IF(N7=\"\",0,N7)-IF(M7=\"\",0,M7)-SUMIFS(THANHTIEN,TK_N,B7,NGAY,\"<\"&CD_START)+SUMIFS(THANHTIEN,TK_C,B7,NGAY,\"<\"&CD_START),0)","v":0},{"$f":"+SUMIFS(THANHTIEN,TK_N,B7,NGAY,\"<=\"&CD_START,NGAY,\">=\"&CD_END)","v":0},{"$f":"++SUMIFS(THANHTIEN,TK_C,B7,NGAY,\">=\"&CD_START,NGAY,\"<=\"&CD_END)","v":165875},{"$f":"+MAX(D7+F7-E7-G7,0)","v":9834125},{"$f":"+MAX(E7+G7-D7-F7,0)","v":0},null,111,"Tiền mặt",10000000]
[2,{"$f":"IF(K8=\"\",\"\",K8)","v":112},"Tiền trên TK cá nhân",20000000,0,0,165875,{"$f":"+MAX(D8+F8-E8-G8,0)","v":19834125},{"$f":"+MAX(E8+G8-D8-F8,0)","v":0},null,112,"Tiền trên TK cá nhân",20000000]
[3,113,"Tiền trên TK công ty",500000,0,12000000,0,{"$f":"+MAX(D9+F9-E9-G9,0)","v":12500000},{"$f":"+MAX(E9+G9-D9-F9,0)","v":0},null,113,"Tiền trên TK công ty",500000]
[4,"","",0,0,0,0,0,0]
{"$rows_left_out":6}